Target
Beta-secretase 2
Ligand
BDBM130206
Substrate
Meas. Tech.
Fluorescent-Peptide Cleavage Assay
Temperature
277.15±n/a K
IC50
14±n/a nM
Comments
extracted
Citation
 Banner, DGabellieri, EGuba, WHilpert, HHornsperger, BHumm, RMauser, HMayweg, AVNarquizian, RPinard, ERogers-Evans, MWoltering, TWostl, W 1,4,5,6-tetrahydro-pyrimidin-2-ylamine compounds US Patent  US8815881 Publication Date 8/26/2014 
Target
Name:
Beta-secretase 2
Synonyms:
AEPLC ASP1 Asp 1 Aspartyl protease 1 BACE2_HUMAN Beta-secretase (BACE) Beta-secretase 2 (BACE-2) Beta-site APP-cleaving enzyme 2 Memapsin-1 beta-Secretase (BACE-2)
Type:
Protein
Mol. Mass.:
56171.20
Organism:
Homo sapiens (Human)
Description:
Q9Y5Z0
Residue:
518
  
Inhibitor
Name:
BDBM130206
Synonyms:
US8815881, 168
Type:
Small organic molecule
Emp. Form.:
C21H21ClFN5O
Mol. Mass.:
413.876
SMILES:
CN1C(N)=N[C@](C)(c2cc(Nc3ccc(cc3Cl)C#N)ccc2F)C(C)(C)C1=O
: