Target
Coagulation factor XI
Ligand
BDBM285519
Substrate
Meas. Tech.
Measurement of FXIa Inhibition
pH
7.4±n/a
Temperature
298.15±n/a K
IC50
93.0±n/a nM
Comments
extracted
Citation
 Röhrig, SHillisch, AStraβburger, JHeitmeier, SSchmidt, MVSchlemmer, KTersteegen, ABuchmüller, AGerdes, CSchäfer, MTeller, HJiménez Núnez, ESchirok, HKlar, JLobell, M Substituted oxopyridine derivatives US Patent  US10077265 Publication Date 9/18/2018 
Target
Name:
Coagulation factor XI
Synonyms:
Coagulation factor XIa Coagulation factor XIa light chain FA11_HUMAN Factor XIa PTA | Plasma thromboplastin antecedent
Type:
Enzyme
Mol. Mass.:
70130.58
Organism:
Homo sapiens (Human)
Description:
P03951
Residue:
625
  
Inhibitor
Name:
BDBM285519
Synonyms:
5-({2-[4-(5-Chloro-2-cyanophenyl)-5-methoxy-2-oxopyridin-1(2H)-yl]-4-methoxybutanoyl}amino)-N,N-dimethylpyrazolo[1,5-a]pyridine-3-carboxamide (racemate) | US10077265, Example 6
Type:
Small organic molecule
Emp. Form.:
C28H27ClN6O5
Mol. Mass.:
563.004
SMILES:
COCCC(C(=O)Nc1ccn2ncc(C(=O)N(C)C)c2c1)n1cc(OC)c(cc1=O)-c1cc(Cl)ccc1C#N
: