Target
Cathepsin S
Ligand
BDBM130420
Substrate
Meas. Tech.
Enzyme Inhibition Assay
pH
6.5±n/a
IC50
0.492±n/a nM
Citation
 Anselm, LBanner, DHaap, WKuhn, BLuebbers, TPeters, JSpinnler, B Azetidine derivatives US Patent  US8822505 Publication Date 9/2/2014 
Target
Name:
Cathepsin S
Synonyms:
CATS_HUMAN Cathepsin S (Cat S) | cathepsin S preproprotein
Type:
Protein
Mol. Mass.:
37507.38
Organism:
Homo sapiens (Human)
Description:
P25774
Residue:
331
  
Inhibitor
Name:
BDBM130420
Synonyms:
US8822505, 22 US8822505, 26
Type:
Small organic molecule
Emp. Form.:
C29H29BrClF2N5O6S
Mol. Mass.:
728.989
SMILES:
CC(C)(C)OC(=O)N1CCC1(C(=O)N1C[C@@H](C[C@H]1C(=O)NC1(CC1)C#N)S(=O)(=O)c1ccc(F)cc1Cl)c1ncc(Br)cc1F
: