Target
Ketohexokinase
Ligand
BDBM130554
Substrate
Meas. Tech.
Enzyme Assay
Temperature
298.15±n/a K
IC50
2030±n/a nM
Comments
extracted
Citation
 Zhang, XAbad, MCGibbs, ACKuo, GKuo, LCSong, FSui, Z Indazole compounds useful as ketohexokinase inhibitors US Patent  US8822447 Publication Date 9/2/2014 
Target
Name:
Ketohexokinase
Synonyms:
Hepatic fructokinase KHK_HUMAN Ketohexokinase (KHK) | Ketohexokinase (KHK) Isoform C
Type:
Enzyme Catalytic Domain
Mol. Mass.:
32521.64
Organism:
Homo sapiens (Human)
Description:
Residue:
298
  
Inhibitor
Name:
BDBM130554
Synonyms:
US8822447, 18 | US9771375, Example 18
Type:
Small organic molecule
Emp. Form.:
C24H25N5S
Mol. Mass.:
415.554
SMILES:
CSc1nn(-c2ccccc2)c2cc(ccc12)N1CCN(Cc2ccncc2)CC1
: