Target
Ketohexokinase
Ligand
BDBM50349755
Substrate
Meas. Tech.
Enzyme Assay
Temperature
298.15±n/a K
IC50
5360±n/a nM
Comments
extracted
Citation
 Zhang, XAbad, MCGibbs, ACKuo, GKuo, LCSong, FSui, Z Indazole compounds useful as ketohexokinase inhibitors US Patent  US8822447 Publication Date 9/2/2014 
Target
Name:
Ketohexokinase
Synonyms:
Hepatic fructokinase KHK_HUMAN Ketohexokinase (KHK) | Ketohexokinase (KHK) Isoform C
Type:
Enzyme Catalytic Domain
Mol. Mass.:
32521.64
Organism:
Homo sapiens (Human)
Description:
Residue:
298
  
Inhibitor
Name:
BDBM50349755
Synonyms:
CHEMBL1809182 US9771375, Example 50
Type:
Small organic molecule
Emp. Form.:
C21H24N4
Mol. Mass.:
332.4421
SMILES:
CCc1nn(-c2ccccc2)c2cc(ccc12)N1CC2CNCC2C1
: