Target
Ketohexokinase
Ligand
BDBM130581
Substrate
Meas. Tech.
Enzyme Assay
Temperature
298.15±n/a K
IC50
7500±n/a nM
Comments
extracted
Citation
 Zhang, XAbad, MCGibbs, ACKuo, GKuo, LCSong, FSui, Z Indazole compounds useful as ketohexokinase inhibitors US Patent  US8822447 Publication Date 9/2/2014 
Target
Name:
Ketohexokinase
Synonyms:
Hepatic fructokinase KHK_HUMAN Ketohexokinase (KHK) | Ketohexokinase (KHK) Isoform C
Type:
Enzyme Catalytic Domain
Mol. Mass.:
32521.64
Organism:
Homo sapiens (Human)
Description:
Residue:
298
  
Inhibitor
Name:
BDBM130581
Synonyms:
US8822447, 58 | US9771375, Example 58
Type:
Small organic molecule
Emp. Form.:
C24H24N4
Mol. Mass.:
368.4742
SMILES:
Cc1nn(-c2ccccc2)c2cc(ccc12)-c1ccc(cc1)N1CCNCC1
: