Target
Ketohexokinase
Ligand
BDBM130615
Substrate
Meas. Tech.
Enzyme Assay
Temperature
298.15±n/a K
IC50
11500±n/a nM
Comments
extracted
Citation
 Zhang, XAbad, MCGibbs, ACKuo, GKuo, LCSong, FSui, Z Indazole compounds useful as ketohexokinase inhibitors US Patent  US8822447 Publication Date 9/2/2014 
Target
Name:
Ketohexokinase
Synonyms:
Hepatic fructokinase KHK_HUMAN Ketohexokinase (KHK) | Ketohexokinase (KHK) Isoform C
Type:
Enzyme Catalytic Domain
Mol. Mass.:
32521.64
Organism:
Homo sapiens (Human)
Description:
Residue:
298
  
Inhibitor
Name:
BDBM130615
Synonyms:
US8822447, 95
Type:
Small organic molecule
Emp. Form.:
C23H30N6O
Mol. Mass.:
406.5239
SMILES:
CCc1nn(-c2ccccc2)c2nc([nH]c(=O)c12)C1CCN(CC1)C1CCNCC1
: