Target
Ketohexokinase
Ligand
BDBM130620
Substrate
Meas. Tech.
Enzyme Assay
Temperature
298.15±n/a K
IC50
1720±n/a nM
Comments
extracted
Citation
 Zhang, XAbad, MCGibbs, ACKuo, GKuo, LCSong, FSui, Z Indazole compounds useful as ketohexokinase inhibitors US Patent  US8822447 Publication Date 9/2/2014 
Target
Name:
Ketohexokinase
Synonyms:
Hepatic fructokinase KHK_HUMAN Ketohexokinase (KHK) | Ketohexokinase (KHK) Isoform C
Type:
Enzyme Catalytic Domain
Mol. Mass.:
32521.64
Organism:
Homo sapiens (Human)
Description:
Residue:
298
  
Inhibitor
Name:
BDBM130620
Synonyms:
US8822447, 100 | US9771375, Example 100
Type:
Small organic molecule
Emp. Form.:
C25H27N5O
Mol. Mass.:
413.5148
SMILES:
CCc1nn(-c2ccccc2)c2nc(cc(O)c12)-c1ccc(NC2CCNCC2)cc1
: