Target
Ketohexokinase
Ligand
BDBM130632
Substrate
Meas. Tech.
Enzyme Assay
Temperature
298.15±n/a K
IC50
380±n/a nM
Comments
extracted
Citation
 Zhang, XAbad, MCGibbs, ACKuo, GKuo, LCSong, FSui, Z Indazole compounds useful as ketohexokinase inhibitors US Patent  US8822447 Publication Date 9/2/2014 
Target
Name:
Ketohexokinase
Synonyms:
Hepatic fructokinase KHK_HUMAN Ketohexokinase (KHK) | Ketohexokinase (KHK) Isoform C
Type:
Enzyme Catalytic Domain
Mol. Mass.:
32521.64
Organism:
Homo sapiens (Human)
Description:
Residue:
298
  
Inhibitor
Name:
BDBM130632
Synonyms:
US8822447, 119 | US9771375, Example 119
Type:
Small organic molecule
Emp. Form.:
C24H31N5S
Mol. Mass.:
421.601
SMILES:
CSc1nn(-c2cccc(C)c2)c2cc(ccc12)N1CCN(CC1)C1CCNCC1
: