Target
Ketohexokinase
Ligand
BDBM130660
Substrate
Meas. Tech.
Enzyme Assay
Temperature
298.15±n/a K
IC50
>10000±n/a nM
Comments
extracted
Citation
 Zhang, XAbad, MCGibbs, ACKuo, GKuo, LCSong, FSui, Z Indazole compounds useful as ketohexokinase inhibitors US Patent  US8822447 Publication Date 9/2/2014 
Target
Name:
Ketohexokinase
Synonyms:
Hepatic fructokinase KHK_HUMAN Ketohexokinase (KHK) | Ketohexokinase (KHK) Isoform C
Type:
Enzyme Catalytic Domain
Mol. Mass.:
32521.64
Organism:
Homo sapiens (Human)
Description:
Residue:
298
  
Inhibitor
Name:
BDBM130660
Synonyms:
US8822447, 171 | US9771375, Example 171
Type:
Small organic molecule
Emp. Form.:
C23H18N4OS
Mol. Mass.:
398.48
SMILES:
CSc1nn(-c2ccccc2)c2cc(ccc12)C(=O)c1ccc2ncn(C)c2c1
: