Target
Fibroblast growth factor receptor 1
Ligand
BDBM130881
Substrate
Meas. Tech.
Enzyme Inhibition Assay
IC50
1.4±n/a nM
Citation
 Taka, NOhmori, MTakami, KMatsushita, MHayase, THyodo, IKochi, MNishii, HEbiike, HNakanishi, YMio, TWang, LZhao, W Aminopyrazole derivative US Patent  US8829199 Publication Date 9/9/2014 
Target
Name:
Fibroblast growth factor receptor 1
Synonyms:
BFGFR Basic fibroblast growth factor receptor 1 (FGFR1) CEK FGFR-1 FGFR-1, (FL) FGFR1_HUMAN FLT2 Fibroblast growth factor receptor 1 (FGFR-1) Fms-like tyrosine kinase 2 N-sam bFGF-R | c-fgr
Type:
Receptor
Mol. Mass.:
91861.70
Organism:
Homo sapiens (Human)
Description:
P11362
Residue:
822
  
Inhibitor
Name:
BDBM130881
Synonyms:
US8829199, 158
Type:
Small organic molecule
Emp. Form.:
C25H24N7O
Mol. Mass.:
438.5044
SMILES:
Cc1nc2ccc(cc2n1)-n1ncc(C(=O)c2cc3cc(CN4CCCC4)ccc3[nH]2)c1N
: