Target
Fibroblast growth factor receptor 2
Ligand
BDBM130881
Substrate
Meas. Tech.
Enzyme Inhibition Assay
IC50
4.6±n/a nM
Citation
 Taka, NOhmori, MTakami, KMatsushita, MHayase, THyodo, IKochi, MNishii, HEbiike, HNakanishi, YMio, TWang, LZhao, W Aminopyrazole derivative US Patent  US8829199 Publication Date 9/9/2014 
Target
Name:
Fibroblast growth factor receptor 2
Synonyms:
BEK FGFR-2 FGFR2 Fibroblast growth factor receptor 2 (FGFR2) KGFR Keratinocyte growth factor receptor VEGF-receptor 2 and Fibroblast growth factor receptor 2
Type:
Enzyme
Mol. Mass.:
92015.45
Organism:
Homo sapiens (Human)
Description:
P21802
Residue:
821
  
Inhibitor
Name:
BDBM130881
Synonyms:
US8829199, 158
Type:
Small organic molecule
Emp. Form.:
C25H24N7O
Mol. Mass.:
438.5044
SMILES:
Cc1nc2ccc(cc2n1)-n1ncc(C(=O)c2cc3cc(CN4CCCC4)ccc3[nH]2)c1N
: