Target
High affinity nerve growth factor receptor
Ligand
BDBM130916
Substrate
Meas. Tech.
In Vitro Kinase Activity Assay
pH
7.5±n/a
IC50
41.61±n/a nM
Comments
extracted
Citation
 Gregor, VE Tyrosine kinase inhibitors US Patent  US8822500 Publication Date 9/2/2014 
Target
Name:
High affinity nerve growth factor receptor
Synonyms:
2.7.10.1 NTRK1 NTRK1_HUMAN Neurotrophic tyrosine kinase receptor type 1 Synonyms=MTC TRK1-transforming tyrosine kinase protein TRKA GN Tropomyosin alpha-3 chain/High affinity nerve growth factor receptor Tropomyosin-related kinase A (TrkA) Tyrosine kinase receptor (Trk) Tyrosine kinase receptor A (Trk A) Tyrosine kinase receptor A (TrkA) p140-TrkA
Type:
Mol. Mass.:
87498.18
Organism:
Homo sapiens (Human)
Description:
P04629
Residue:
796
  
Inhibitor
Name:
BDBM130916
Synonyms:
US8822500, [14]
Type:
Small organic molecule
Emp. Form.:
C29H22F4N6O3
Mol. Mass.:
578.517
SMILES:
COC1N(C(=O)c2cc3nc([nH]c3cc12)-c1c(NC(C)Cc2c(F)c(F)cc(F)c2F)cc[nH]c1=O)c1cccnc1
: