Target
Proto-oncogene tyrosine-protein kinase receptor Ret
Ligand
BDBM130909
Substrate
Meas. Tech.
In Vitro Kinase Activity Assay
pH
7.5±n/a
IC50
2.195±n/a nM
Comments
extracted
Citation
 Gregor, VE Tyrosine kinase inhibitors US Patent  US8822500 Publication Date 9/2/2014 
Target
Name:
Proto-oncogene tyrosine-protein kinase receptor Ret
Synonyms:
CDHF12 Cadherin family member 12 Proto-oncogene c-Ret RET51 Tyrosine-protein kinase Ret (RET)
Type:
Protein
Mol. Mass.:
124318.29
Organism:
Homo sapiens (Human)
Description:
P07949
Residue:
1114
  
Inhibitor
Name:
BDBM130909
Synonyms:
US10683289, Example Staurosporine US8822500, Stauro- sporine | US9920060, Staurosporine
Type:
Small organic molecule
Emp. Form.:
C28H26N4O3
Mol. Mass.:
466.531
SMILES:
CNC1CC2OC(C)(C1OC)n1c3ccccc3c3c4CNC(=O)c4c4c5ccccc5n2c4c13
: