Target
G-protein coupled receptor 6
Ligand
BDBM190949
Substrate
Meas. Tech.
Inhibition of cAMP Activity of GPR6 In Vitro A.1 Assay
IC50
131700±n/a nM
Citation
 Brown, JWHitchcock, SHopkins, MKikuchi, SMonenschein, HReichard, HSchleicher, KSun, HMacklin, T Substituted pyrido[3,4-b]pyrazines as GPR6 modulators US Patent  US10077266 Publication Date 9/18/2018 
Target
Name:
G-protein coupled receptor 6
Synonyms:
G-protein coupled receptor 6 (GPR6) GPR6_HUMAN | Sphingosine 1-phosphate receptor GPR6
Type:
Protein
Mol. Mass.:
37886.39
Organism:
Homo sapiens (Human)
Description:
P46095
Residue:
362
  
Inhibitor
Name:
BDBM190949
Synonyms:
US10077266, Example 61 US9708313, 61
Type:
Small organic molecule
Emp. Form.:
C23H29F2N5O3
Mol. Mass.:
461.5049
SMILES:
COC(=O)N1CCc2nc(NC(C)C)c(nc2C1)N1CCC(CC1)Oc1ccc(F)cc1F
: