Target
G-protein coupled receptor 6
Ligand
BDBM285606
Substrate
Meas. Tech.
Inhibition of cAMP Activity of GPR6 In Vitro A.2 Assay
IC50
32700±n/a nM
Citation
 Brown, JWHitchcock, SHopkins, MKikuchi, SMonenschein, HReichard, HSchleicher, KSun, HMacklin, T Substituted pyrido[3,4-b]pyrazines as GPR6 modulators US Patent  US10077266 Publication Date 9/18/2018 
Target
Name:
G-protein coupled receptor 6
Synonyms:
G-protein coupled receptor 6 (GPR6) GPR6_HUMAN | Sphingosine 1-phosphate receptor GPR6
Type:
Protein
Mol. Mass.:
37886.39
Organism:
Homo sapiens (Human)
Description:
P46095
Residue:
362
  
Inhibitor
Name:
BDBM285606
Synonyms:
2-(4-(5-chloro-2-fluorobenzoyl)piperidin-1-yl)-3-(isopropylamino)-N,N-dimethyl-7,8-dihydropyrido[3,4-b]pyrazine-6(5H)-carboxamide | US10077266, Example 88
Type:
Small organic molecule
Emp. Form.:
C24H32ClFN6O2
Mol. Mass.:
491.001
SMILES:
CC(C)Nc1nc2CN(CCc2nc1N1CCC(CC1)Oc1cc(Cl)ccc1F)C(=O)N(C)C
: