Target
G-protein coupled receptor 6
Ligand
BDBM190981
Substrate
Meas. Tech.
Inhibition of cAMP Activity of GPR6 In Vitro A.2 Assay
IC50
19900±n/a nM
Citation
 Brown, JWHitchcock, SHopkins, MKikuchi, SMonenschein, HReichard, HSchleicher, KSun, HMacklin, T Substituted pyrido[3,4-b]pyrazines as GPR6 modulators US Patent  US10077266 Publication Date 9/18/2018 
Target
Name:
G-protein coupled receptor 6
Synonyms:
G-protein coupled receptor 6 (GPR6) GPR6_HUMAN | Sphingosine 1-phosphate receptor GPR6
Type:
Protein
Mol. Mass.:
37886.39
Organism:
Homo sapiens (Human)
Description:
P46095
Residue:
362
  
Inhibitor
Name:
BDBM190981
Synonyms:
US10077266, Example 94 US9708313, 94
Type:
Small organic molecule
Emp. Form.:
C25H32FN5O3
Mol. Mass.:
469.5517
SMILES:
COc1ccc(OC2CCN(CC2)c2nc3CCN(Cc3nc2NC2CCC2)C(C)=O)c(F)c1
: