Target
G-protein coupled receptor 6
Ligand
BDBM190987
Substrate
Meas. Tech.
Inhibition of cAMP Activity of GPR6 In Vitro A.2 Assay
IC50
57200±n/a nM
Citation
 Brown, JWHitchcock, SHopkins, MKikuchi, SMonenschein, HReichard, HSchleicher, KSun, HMacklin, T Substituted pyrido[3,4-b]pyrazines as GPR6 modulators US Patent  US10077266 Publication Date 9/18/2018 
Target
Name:
G-protein coupled receptor 6
Synonyms:
G-protein coupled receptor 6 (GPR6) GPR6_HUMAN | Sphingosine 1-phosphate receptor GPR6
Type:
Protein
Mol. Mass.:
37886.39
Organism:
Homo sapiens (Human)
Description:
P46095
Residue:
362
  
Inhibitor
Name:
BDBM190987
Synonyms:
US10077266, Example 100 US9708313, 100
Type:
Small organic molecule
Emp. Form.:
C21H25F4N5O3S
Mol. Mass.:
503.514
SMILES:
CS(=O)(=O)N1CCc2nc(N3CCC(CC3)Oc3ccc(F)cc3F)c(NCC(F)F)nc2C1
: