Target
G-protein coupled receptor 6
Ligand
BDBM191014
Substrate
Meas. Tech.
Inhibition of cAMP Activity of GPR6 In Vitro A.1 Assay
IC50
>1000000±n/a nM
Citation
 Brown, JWHitchcock, SHopkins, MKikuchi, SMonenschein, HReichard, HSchleicher, KSun, HMacklin, T Substituted pyrido[3,4-b]pyrazines as GPR6 modulators US Patent  US10077266 Publication Date 9/18/2018 
Target
Name:
G-protein coupled receptor 6
Synonyms:
G-protein coupled receptor 6 (GPR6) GPR6_HUMAN | Sphingosine 1-phosphate receptor GPR6
Type:
Protein
Mol. Mass.:
37886.39
Organism:
Homo sapiens (Human)
Description:
P46095
Residue:
362
  
Inhibitor
Name:
BDBM191014
Synonyms:
US10077266, Example 127 US9708313, 127
Type:
Small organic molecule
Emp. Form.:
C24H31F2N5O3
Mol. Mass.:
475.5314
SMILES:
C[C@H](CCO)Nc1nc2CN(CCc2nc1N1CCC(CC1)Oc1ccc(F)cc1F)C(C)=O
: