Target
G-protein coupled receptor 6
Ligand
BDBM191022
Substrate
Meas. Tech.
Inhibition of cAMP Activity of GPR6 In Vitro A.1 Assay
IC50
27000±n/a nM
Citation
 Brown, JWHitchcock, SHopkins, MKikuchi, SMonenschein, HReichard, HSchleicher, KSun, HMacklin, T Substituted pyrido[3,4-b]pyrazines as GPR6 modulators US Patent  US10077266 Publication Date 9/18/2018 
Target
Name:
G-protein coupled receptor 6
Synonyms:
G-protein coupled receptor 6 (GPR6) GPR6_HUMAN | Sphingosine 1-phosphate receptor GPR6
Type:
Protein
Mol. Mass.:
37886.39
Organism:
Homo sapiens (Human)
Description:
P46095
Residue:
362
  
Inhibitor
Name:
BDBM191022
Synonyms:
US10077266, Example 134 US9708313, 134
Type:
Small organic molecule
Emp. Form.:
C23H30F2N6O
Mol. Mass.:
444.5207
SMILES:
CC(C)Nc1nc2CN(CCc2nc1N1CCN(Cc2ccc(F)cc2F)CC1)C(C)=O
: