Target
Acetyl-CoA carboxylase 2
Ligand
BDBM131556
Substrate
Meas. Tech.
Spectrophotometric 384 Well Assay
pH
7.5±n/a
IC50
250±n/a nM
Comments
extracted
Citation
 Roth, GJFleck, MHeine, NKley, JLehmann-Lintz, TNeubauer, HNosse, B Compounds, pharmaceutical compositions and uses thereof US Patent  US8835472 Publication Date 9/16/2014 
Target
Name:
Acetyl-CoA carboxylase 2
Synonyms:
ACACB ACC-beta ACCB Acetyl-CoA carboxylase 2 Acetyl-CoA carboxylase 2 (ACC2)
Type:
Protein
Mol. Mass.:
276535.21
Organism:
Homo sapiens (Human)
Description:
O00763
Residue:
2458
  
Inhibitor
Name:
BDBM131556
Synonyms:
US8835472, 13.60
Type:
Small organic molecule
Emp. Form.:
C18H20N4O
Mol. Mass.:
308.3776
SMILES:
CNc1ncc(cn1)C#Cc1ccc(CC(C)NC(C)=O)cc1
: