Target
Corticotropin-releasing factor receptor 2
Ligand
BDBM131882
Substrate
Meas. Tech.
Homogeneous Time-Resolved Fluorescence Assay
IC50
2026±n/a nM
Citation
 Beattie, DBruce, IColson, ACulshaw, AJSharp, T Cyclohexyl amide derivatives as CRF receptor antagonists US Patent  US8835444 Publication Date 9/16/2014 
Target
Name:
Corticotropin-releasing factor receptor 2
Synonyms:
CRF-R 2 CRF2R CRH-R 2 CRHR2 Corticotropin-releasing factor receptor 2 (CRF-2) Corticotropin-releasing hormone receptor 2
Type:
Enzyme
Mol. Mass.:
47694.70
Organism:
Homo sapiens (Human)
Description:
Q13324
Residue:
411
  
Inhibitor
Name:
BDBM131882
Synonyms:
US8835444, 5.27
Type:
Small organic molecule
Emp. Form.:
C21H25ClF3N3O
Mol. Mass.:
427.891
SMILES:
CCc1cc(C)n(C[C@H]2CC[C@@H](CC2)NC(=O)c2cc(ccc2Cl)C(F)(F)F)n1
: