Target
5-hydroxytryptamine receptor 2A
Ligand
BDBM50352680
Substrate
Meas. Tech.
Binding Assay
pH
7.4±n/a
IC50
32.4±n/a nM
Comments
extracted
Citation
 Lee, JSeo, HJKang, SYPark, EKim, MJLee, SHKim, JYKim, JJung, MEKim, HJKim, MHan, HKAhn, KWLee, MWLee, KPae, ANPark, W Arylpiperazine-containing imidazole 4-carboxamide derivatives and pharmaceutical composition comprising same US Patent  US8835436 Publication Date 9/16/2014 
Target
Name:
5-hydroxytryptamine receptor 2A
Synonyms:
5-HT-2 5-HT2A 5-hydroxytryptamine receptor 2A (5HT-2A) 5HT2A_HUMAN HTR2A | Serotonin receptor 2A
Type:
undefined
Mol. Mass.:
52607.65
Organism:
Homo sapiens (Human)
Description:
P28223
Residue:
471
  
Inhibitor
Name:
BDBM50352680
Synonyms:
CHEMBL1823094 | US8835436, Example 3
Type:
Small organic molecule
Emp. Form.:
C28H36ClN5O
Mol. Mass.:
494.071
SMILES:
CCCc1nc(cn1-c1ccc(Cl)cc1)C(=O)NCCCN1CCN(CC1)c1cccc(C)c1C
: