Target
5-hydroxytryptamine receptor 2C
Ligand
BDBM50352660
Substrate
Meas. Tech.
Binding Assay
pH
7.4±n/a
IC50
204±n/a nM
Comments
extracted
Citation
 Lee, JSeo, HJKang, SYPark, EKim, MJLee, SHKim, JYKim, JJung, MEKim, HJKim, MHan, HKAhn, KWLee, MWLee, KPae, ANPark, W Arylpiperazine-containing imidazole 4-carboxamide derivatives and pharmaceutical composition comprising same US Patent  US8835436 Publication Date 9/16/2014 
Target
Name:
5-hydroxytryptamine receptor 2C
Synonyms:
5-HT-2C 5-HT2C-INI 5-HTR2C 5-hydroxytryptamine receptor 2C (5-HT-2C) 5HT-1C HTR1C Serotonin (5-HT3) receptor Serotonin Receptor 2C
Type:
G Protein-Coupled Receptor (GPCR)
Mol. Mass.:
51836.79
Organism:
Homo sapiens (Human)
Description:
P28335
Residue:
458
  
Inhibitor
Name:
BDBM50352660
Synonyms:
CHEMBL1823074 | US8835436, Example 135
Type:
Small organic molecule
Emp. Form.:
C29H38ClN5O2
Mol. Mass.:
524.097
SMILES:
CCCc1nc(C(=O)NCCCN2CCN(CC2)c2cccc(Cl)c2C)c(C)n1-c1ccc(OC)cc1
: