Target
5-hydroxytryptamine receptor 2C
Ligand
BDBM50352755
Substrate
Meas. Tech.
Binding Assay
pH
7.4±n/a
IC50
37.4±n/a nM
Comments
extracted
Citation
 Lee, JSeo, HJKang, SYPark, EKim, MJLee, SHKim, JYKim, JJung, MEKim, HJKim, MHan, HKAhn, KWLee, MWLee, KPae, ANPark, W Arylpiperazine-containing imidazole 4-carboxamide derivatives and pharmaceutical composition comprising same US Patent  US8835436 Publication Date 9/16/2014 
Target
Name:
5-hydroxytryptamine receptor 2C
Synonyms:
5-HT-2C 5-HT2C-INI 5-HTR2C 5-hydroxytryptamine receptor 2C (5-HT-2C) 5HT-1C HTR1C Serotonin (5-HT3) receptor Serotonin Receptor 2C
Type:
G Protein-Coupled Receptor (GPCR)
Mol. Mass.:
51836.79
Organism:
Homo sapiens (Human)
Description:
P28335
Residue:
458
  
Inhibitor
Name:
BDBM50352755
Synonyms:
CHEMBL1823068 | US8835436, Example 144
Type:
Small organic molecule
Emp. Form.:
C27H34ClN5O2
Mol. Mass.:
496.044
SMILES:
COc1ccccc1-n1c(C)nc(C(=O)NCCCN2CCN(CC2)c2cccc(Cl)c2C)c1C
: