Target
Sodium-dependent serotonin transporter
Ligand
BDBM131894
Substrate
Meas. Tech.
Binding Assay
pH
7.4±n/a
IC50
9±n/a nM
Comments
extracted
Citation
 Lee, JSeo, HJKang, SYPark, EKim, MJLee, SHKim, JYKim, JJung, MEKim, HJKim, MHan, HKAhn, KWLee, MWLee, KPae, ANPark, W Arylpiperazine-containing imidazole 4-carboxamide derivatives and pharmaceutical composition comprising same US Patent  US8835436 Publication Date 9/16/2014 
Target
Name:
Sodium-dependent serotonin transporter
Synonyms:
5-HT Transporter 5HTT SC6A4_HUMAN SLC6A4 Serotonin transporter (5HTT) Sodium-dependent serotonin transporter (SERT) | Solute carrier family 6 member 4
Type:
Multi-pass membrane protein
Mol. Mass.:
70322.51
Organism:
Homo sapiens (Human)
Description:
P31645
Residue:
630
  
Inhibitor
Name:
BDBM131894
Synonyms:
US8835436, Example 109
Type:
Small organic molecule
Emp. Form.:
C28H37N5O2
Mol. Mass.:
475.6257
SMILES:
CCc1nc(C(=O)NCC(O)CN2CCN(CC2)c2cccc(C)c2C)c(C)n1-c1ccccc1
: