Target
Cyclin-dependent kinase 4
Ligand
BDBM132293
Substrate
Meas. Tech.
In Vitro Assay
pH
7.4±n/a
Temperature
310.15±n/a K
IC50
0.83±n/a nM
Citation
 Connors, RVKang, DEksterowicz, JFan, PFisher, BFu, JLi, KLi, ZMcGee, LRSharma, RWang, XMcMinn, DLMihalic, JTDeignan, J Fused pyridine, pyrimidine and triazine compounds as cell cycle inhibitors US Patent  US8841312 Publication Date 9/23/2014 
Target
Name:
Cyclin-dependent kinase 4
Synonyms:
CDK4 Cell division protein kinase 4 PSK-J3
Type:
Enzyme Subunit
Mol. Mass.:
33731.96
Organism:
Homo sapiens (Human)
Description:
P11802
Residue:
303
  
Inhibitor
Name:
BDBM132293
Synonyms:
US8841312, 36
Type:
Small organic molecule
Emp. Form.:
C24H27N7
Mol. Mass.:
413.5181
SMILES:
C1CCC(C1)n1c2ncccc2c2cnc(Nc3ccc(cc3)N3CCNCC3)nc12
: