Target
Cyclin-dependent kinase 4
Ligand
BDBM132303
Substrate
Meas. Tech.
In Vitro Assay
pH
7.4±n/a
Temperature
310.15±n/a K
IC50
2±n/a nM
Citation
 Connors, RVKang, DEksterowicz, JFan, PFisher, BFu, JLi, KLi, ZMcGee, LRSharma, RWang, XMcMinn, DLMihalic, JTDeignan, J Fused pyridine, pyrimidine and triazine compounds as cell cycle inhibitors US Patent  US8841312 Publication Date 9/23/2014 
Target
Name:
Cyclin-dependent kinase 4
Synonyms:
CDK4 Cell division protein kinase 4 PSK-J3
Type:
Enzyme Subunit
Mol. Mass.:
33731.96
Organism:
Homo sapiens (Human)
Description:
P11802
Residue:
303
  
Inhibitor
Name:
BDBM132303
Synonyms:
US8841312, 46
Type:
Small organic molecule
Emp. Form.:
C25H28N6O
Mol. Mass.:
428.5294
SMILES:
C1CN(CCN1)c1ccc(Nc2ncc3c(n2)n(C2CCOCC2)c2ccccc32)cc1
: