Target
Cyclin-dependent kinase 6
Ligand
BDBM132516
Substrate
Meas. Tech.
In Vitro Assay
pH
7.4±n/a
Temperature
310.15±n/a K
IC50
2.2±n/a nM
Citation
 Connors, RVKang, DEksterowicz, JFan, PFisher, BFu, JLi, KLi, ZMcGee, LRSharma, RWang, XMcMinn, DLMihalic, JTDeignan, J Fused pyridine, pyrimidine and triazine compounds as cell cycle inhibitors US Patent  US8841312 Publication Date 9/23/2014 
Target
Name:
Cyclin-dependent kinase 6
Synonyms:
CDK6 CDKN6 Cyclin-dependent kinase 6 (CDK 6) | Serine/threonine-protein kinase PLSTIRE
Type:
Enzyme Subunit
Mol. Mass.:
36937.42
Organism:
Homo sapiens (Human)
Description:
Q00534
Residue:
326
  
Inhibitor
Name:
BDBM132516
Synonyms:
US8841312, 265
Type:
Small organic molecule
Emp. Form.:
C24H24N6O2S
Mol. Mass.:
460.551
SMILES:
O=S1(=O)CCC(=CC1)c1ccc(Nc2ncc3c(n2)n(C2CCCC2)c2cnccc32)nc1
: