Target
Gamma-aminobutyric acid receptor subunit alpha-5
Ligand
BDBM133559
Substrate
Meas. Tech.
Radioligand Binding Assay
pH
7.5±n/a
Temperature
277.15±n/a K
Ki
0.9±n/a nM
Comments
extracted
Citation
 Buettelmann, BJakob-Roetne, RKnust, HLucas, MCThomas, A Isoxazolo-pyridine derivatives US Patent  US8846719 Publication Date 9/30/2014 
Target
Name:
Gamma-aminobutyric acid receptor subunit alpha-5
Synonyms:
GABA receptor alpha-5 subunit GABRA5 Gamma-aminobutyric acid receptor subunit alpha-5 (GABA(A)) | Gamma-aminobutyric acid receptor subunit alpha-5 (GABAA)
Type:
Enzyme
Mol. Mass.:
52160.59
Organism:
Homo sapiens (Human)
Description:
P31644
Residue:
462
  
Inhibitor
Name:
BDBM133559
Synonyms:
US11091471, Example RO-251 | US8846719, 251
Type:
Small organic molecule
Emp. Form.:
C23H25N3O4
Mol. Mass.:
407.4623
SMILES:
Cc1onc(c1COc1ccc(cn1)C(=O)NC1CCOCC1)-c1ccc(C)cc1
: