Target
Cannabinoid receptor 1
Ligand
BDBM143613
Substrate
Meas. Tech.
cAMP Assay
Temperature
300.15±n/a K
EC50
35±n/a nM
Comments
extracted
Citation
 Macielag, MJZhang, YDeCorte, BLGreco, MN Quinazoline derivatives useful as CB-1 inverse agonists US Patent  US9682955 Publication Date 6/20/2017 
Target
Name:
Cannabinoid receptor 1
Synonyms:
CANN6 CB-R CNR CNR1_HUMAN Cannabinoid receptor Cannabinoid receptor 1 (brain)
Type:
G Protein-Coupled Receptor (GPCR)
Mol. Mass.:
52868.96
Organism:
Homo sapiens (Human)
Description:
P21554
Residue:
472
  
Inhibitor
Name:
BDBM143613
Synonyms:
US9682955, 6
Type:
Small organic molecule
Emp. Form.:
C27H26Cl2N4O2S
Mol. Mass.:
541.492
SMILES:
Clc1ccc(cc1)C(c1ccc(Cl)cc1)c1ccc2ncnc(NCCN3CCS(=O)(=O)CC3)c2c1
: