Target
Cannabinoid receptor 1
Ligand
BDBM143540
Substrate
Meas. Tech.
cAMP Assay
Temperature
300.15±n/a K
EC50
4.00±n/a nM
Comments
extracted
Citation
 Macielag, MJZhang, YDeCorte, BLGreco, MN Quinazoline derivatives useful as CB-1 inverse agonists US Patent  US9682955 Publication Date 6/20/2017 
Target
Name:
Cannabinoid receptor 1
Synonyms:
CANN6 CB-R CNR CNR1_HUMAN Cannabinoid receptor Cannabinoid receptor 1 (brain)
Type:
G Protein-Coupled Receptor (GPCR)
Mol. Mass.:
52868.96
Organism:
Homo sapiens (Human)
Description:
P21554
Residue:
472
  
Inhibitor
Name:
BDBM143540
Synonyms:
US9682955, 79
Type:
Small organic molecule
Emp. Form.:
C35H32Cl2N4O2
Mol. Mass.:
611.56
SMILES:
COC(=O)Cc1ccc(cc1)N1CCC(CC1)Nc1ncnc2ccc(cc12)C(c1ccc(Cl)cc1)c1ccc(Cl)cc1
: