Target
Isoform 3 of cAMP-specific 3',5'-cyclic phosphodiesterase 4D (hPDE4D3)
Ligand
BDBM285535
Substrate
Meas. Tech.
The PDE4A3, PDE4B1, PDE4C1 and PDE4D3 assays
IC50
64.9±n/a nM
Citation
 Chappie, TAPatel, NCHayward, MMHelal, CJSciabola, SLaChapelle, EAYoung, JMVerhoest, PR Imidazopyridazine compounds US Patent  US10077269 Publication Date 9/18/2018 
Target
Name:
Isoform 3 of cAMP-specific 3',5'-cyclic phosphodiesterase 4D (hPDE4D3)
Synonyms:
DPDE3 NP_000914.2 PDE4D PDE4D_HUMAN Q08499-2 cAMP-specific 3',5'-cyclic phosphodiesterase 4D (hPDE4D3)
Type:
Mol. Mass.:
76431.39
Organism:
Homo sapiens (Human)
Description:
Q08499-2
Residue:
673
  
Inhibitor
Name:
BDBM285535
Synonyms:
Azetidin-1-yl[3-(pyrazolo[1,5-a]pyridin-6-yl)imidazo[1,2-b]pyridazin-2-yl]methanone (8) US10669279, Example 8
Type:
Small organic molecule
Emp. Form.:
C17H14N6O
Mol. Mass.:
318.3327
SMILES:
O=C(N1CCC1)c1nc2cccnn2c1-c1ccc2ccnn2c1
: