Target
Isoform 3 of cAMP-specific 3',5'-cyclic phosphodiesterase 4D (hPDE4D3)
Ligand
BDBM285550
Substrate
Meas. Tech.
The PDE4A3, PDE4B1, PDE4C1 and PDE4D3 assays
IC50
4130±n/a nM
Citation
 Chappie, TAPatel, NCHayward, MMHelal, CJSciabola, SLaChapelle, EAYoung, JMVerhoest, PR Imidazopyridazine compounds US Patent  US10077269 Publication Date 9/18/2018 
Target
Name:
Isoform 3 of cAMP-specific 3',5'-cyclic phosphodiesterase 4D (hPDE4D3)
Synonyms:
DPDE3 NP_000914.2 PDE4D PDE4D_HUMAN Q08499-2 cAMP-specific 3',5'-cyclic phosphodiesterase 4D (hPDE4D3)
Type:
Mol. Mass.:
76431.39
Organism:
Homo sapiens (Human)
Description:
Q08499-2
Residue:
673
  
Inhibitor
Name:
BDBM285550
Synonyms:
4-[2-(azetidin-1-ylcarbonyl)imidazo[1,2-b]pyridazin-3-yl]-2-fluorobenzonitrile US10669279, Example 23 | US9598421, Example 23
Type:
Small organic molecule
Emp. Form.:
C17H12FN5O
Mol. Mass.:
321.3085
SMILES:
Fc1cc(ccc1C#N)-c1c(nc2cccnn12)C(=O)N1CCC1
: