Target
Isoform 3 of cAMP-specific 3',5'-cyclic phosphodiesterase 4D (hPDE4D3)
Ligand
BDBM285611
Substrate
Meas. Tech.
The PDE4A3, PDE4B1, PDE4C1 and PDE4D3 assays
IC50
25.8±n/a nM
Citation
 Chappie, TAPatel, NCHayward, MMHelal, CJSciabola, SLaChapelle, EAYoung, JMVerhoest, PR Imidazopyridazine compounds US Patent  US10077269 Publication Date 9/18/2018 
Target
Name:
Isoform 3 of cAMP-specific 3',5'-cyclic phosphodiesterase 4D (hPDE4D3)
Synonyms:
DPDE3 NP_000914.2 PDE4D PDE4D_HUMAN Q08499-2 cAMP-specific 3',5'-cyclic phosphodiesterase 4D (hPDE4D3)
Type:
Mol. Mass.:
76431.39
Organism:
Homo sapiens (Human)
Description:
Q08499-2
Residue:
673
  
Inhibitor
Name:
BDBM285611
Synonyms:
3-(4-chloro-3-fluorophenyl)-N-ethylimidazo[1,2-b]pyridazine-2-carboxamide US10669279, Example 81 | US9598421, Example 81
Type:
Small organic molecule
Emp. Form.:
C15H12ClFN4O
Mol. Mass.:
318.733
SMILES:
CCNC(=O)c1nc2cccnn2c1-c1ccc(Cl)c(F)c1
: