Target
Focal adhesion kinase 1
Ligand
BDBM134166
Substrate
Meas. Tech.
Enzyme Assay
pH
7.5±n/a
IC50
1±n/a nM
Comments
extracted
Citation
 Stadtmueller, HSapountzis, I Substituted pyrimidines for the treatment of diseases such as cancer US Patent  US8846689 Publication Date 9/30/2014 
Target
Name:
Focal adhesion kinase 1
Synonyms:
FADK 1 FAK1 FLT4 Focal adhesion kinase (FAK) Focal adhesion kinase 1 (FAK) Focal adhesion kinase-related nonkinase PTK2 Protein-tyrosine kinase 2 p125FAK | pp125FAK
Type:
Tyrosine-protein kinase
Mol. Mass.:
119233.17
Organism:
Homo sapiens (Human)
Description:
Q05397
Residue:
1052
  
Inhibitor
Name:
BDBM134166
Synonyms:
US8846689, 168
Type:
Small organic molecule
Emp. Form.:
C28H30ClFN6O5
Mol. Mass.:
585.026
SMILES:
CO[C@H]1CN(C)CC[C@H]1NC(=O)c1cc(OC)c(Nc2ncc(Cl)c(Oc3cccc4CN(C)C(=O)c34)n2)cc1F
: