Target
Tyrosine-protein kinase BTK
Ligand
BDBM134217
Substrate
Meas. Tech.
Enzyme Assay
pH
7.4±n/a
Temperature
273.15±n/a K
IC50
9410±n/a nM
Citation
 Duan, JJiang, BLu, Z Azaindazoles as kinase inhibitors and use thereof US Patent  US8846673 Publication Date 9/30/2014 
Target
Name:
Tyrosine-protein kinase BTK
Synonyms:
AGMX1 Agammaglobulinaemia tyrosine kinase B cell progenitor kinase BPK BTK_HUMAN Tyrosine Kinase BTK Tyrosine-protein kinase BTK (BTK)
Type:
Enzyme
Mol. Mass.:
76289.95
Organism:
Homo sapiens (Human)
Description:
Q06187
Residue:
659
  
Inhibitor
Name:
BDBM134217
Synonyms:
US8846673, 31
Type:
Small organic molecule
Emp. Form.:
C27H26N8O2S
Mol. Mass.:
526.613
SMILES:
Cc1csc(NC(=O)NC2CCN(C2)c2cc(-c3ccc(Oc4ccccc4)cc3)c3c(N)n[nH]c3n2)n1
: