Target
Tyrosine-protein kinase BTK
Ligand
BDBM134245
Substrate
Meas. Tech.
Enzyme Assay
pH
7.4±n/a
Temperature
273.15±n/a K
IC50
2±n/a nM
Citation
 Duan, JJiang, BLu, Z Azaindazoles as kinase inhibitors and use thereof US Patent  US8846673 Publication Date 9/30/2014 
Target
Name:
Tyrosine-protein kinase BTK
Synonyms:
AGMX1 Agammaglobulinaemia tyrosine kinase B cell progenitor kinase BPK BTK_HUMAN Tyrosine Kinase BTK Tyrosine-protein kinase BTK (BTK)
Type:
Enzyme
Mol. Mass.:
76289.95
Organism:
Homo sapiens (Human)
Description:
Q06187
Residue:
659
  
Inhibitor
Name:
BDBM134245
Synonyms:
US8846673, 238
Type:
Small organic molecule
Emp. Form.:
C26H25N5O4
Mol. Mass.:
471.5078
SMILES:
COC(=O)C(=O)N1CCCC(C1)c1cc2[nH]nc(N)c2c(n1)-c1ccc(Oc2ccccc2)cc1
: