Target
Chymase
Ligand
BDBM134255
Substrate
Meas. Tech.
Inhibitory Assay
pH
7.5±n/a
Temperature
298.15±n/a K
IC50
30±n/a nM
Comments
extracted
Citation
 Muto, TTanaka, TFutamura, JImajo, SSugawara, H Seven-membered ring compound and pharmaceutical use therefor US Patent  US8846660 Publication Date 9/30/2014 
Target
Name:
Chymase
Synonyms:
Alpha-chymase CMA1_HUMAN CYM Mast cell protease I
Type:
Enzyme
Mol. Mass.:
27340.12
Organism:
Homo sapiens (Human)
Description:
Residue:
247
  
Inhibitor
Name:
BDBM134255
Synonyms:
US8846660, 15
Type:
Small organic molecule
Emp. Form.:
C28H36ClN5O6
Mol. Mass.:
574.068
SMILES:
CCC[C@@H](NC(=O)N1C\C(NCC(Cc2cc(Cl)ccc2OC)C1=O)=N\OC(C)C)c1ccc(C(O)=O)c(N)c1
: