Target
Chymase
Ligand
BDBM134267
Substrate
Meas. Tech.
Inhibitory Assay
pH
7.5±n/a
Temperature
298.15±n/a K
IC50
3±n/a nM
Comments
extracted
Citation
 Muto, TTanaka, TFutamura, JImajo, SSugawara, H Seven-membered ring compound and pharmaceutical use therefor US Patent  US8846660 Publication Date 9/30/2014 
Target
Name:
Chymase
Synonyms:
Alpha-chymase CMA1_HUMAN CYM Mast cell protease I
Type:
Enzyme
Mol. Mass.:
27340.12
Organism:
Homo sapiens (Human)
Description:
Residue:
247
  
Inhibitor
Name:
BDBM134267
Synonyms:
US8846660, 41
Type:
Small organic molecule
Emp. Form.:
C30H29ClF2N4O6
Mol. Mass.:
615.024
SMILES:
COc1ccc(Cl)cc1CC1CN\C(CN(C(=O)N[C@H](C)c2ccc(CC(O)=O)cc2)C1=O)=N/Oc1cc(F)cc(F)c1
: