Target
Cyclin-dependent kinase 4
Ligand
BDBM50358223
Substrate
Meas. Tech.
Kinase Assay
pH
7.4±n/a
IC50
24000±n/a nM
Comments
extracted
Citation
 Fischer, PMJarman, MMcDonald, ENutley, BRaynaud, FWilson, SWorkman, P Purine derivatives US Patent  US8846696 Publication Date 9/30/2014 
Target
Name:
Cyclin-dependent kinase 4
Synonyms:
CDK4 Cell division protein kinase 4 PSK-J3
Type:
Enzyme Subunit
Mol. Mass.:
33731.96
Organism:
Homo sapiens (Human)
Description:
P11802
Residue:
303
  
Inhibitor
Name:
BDBM50358223
Synonyms:
CHEMBL1922122 | US8846696, (3RS,4R)-4-{9-Isopropyl-6-[(pyridin-3-ylmethyl)-amino]-9H-purin-2-ylamino}-2,2-dimethyl-hexan-3-ol
Type:
Small organic molecule
Emp. Form.:
C22H33N7O
Mol. Mass.:
411.5437
SMILES:
CC[C@@H](Nc1nc(NCc2cccnc2)c2ncn(C(C)C)c2n1)C(O)C(C)(C)C
: