Target
cAMP-dependent protein kinase catalytic subunit alpha
Ligand
BDBM50358221
Substrate
Meas. Tech.
Kinase Assay
pH
7.4±n/a
IC50
>200000±n/a nM
Comments
extracted
Citation
 Fischer, PMJarman, MMcDonald, ENutley, BRaynaud, FWilson, SWorkman, P Purine derivatives US Patent  US8846696 Publication Date 9/30/2014 
Target
Name:
cAMP-dependent protein kinase catalytic subunit alpha
Synonyms:
KAPCA_HUMAN PKACA cAMP-dependent protein kinase (PKA) cAMP-dependent protein kinase catalytic subunit alpha cAMP-dependent protein kinase catalytic subunit alpha (PKACA) cAMP-dependent protein kinase catalytic subunit alpha isoform 1 | cAMP-dependent protein kinase, alpha-catalytic subunit
Type:
Enzyme Catalytic Subunit
Mol. Mass.:
40598.73
Organism:
Homo sapiens (Human)
Description:
Residue:
351
  
Inhibitor
Name:
BDBM50358221
Synonyms:
CHEMBL1922120 | US8846696, (3RS,4R)-4-{9-Isopropyl-6-[(pyridin-3-ylmethyl)-amino]-9H-purin-2-ylamino}-hexan-3-ol
Type:
Small organic molecule
Emp. Form.:
C20H29N7O
Mol. Mass.:
383.4906
SMILES:
CCC(O)[C@@H](CC)Nc1nc(NCc2cccnc2)c2ncn(C(C)C)c2n1
: