Target
Dihydrofolate reductase
Ligand
BDBM50429697
Substrate
Meas. Tech.
Enzyme Inhibition Assay
IC50
19±n/a nM
Citation
 Anderson, ACWright, DLFrey, KMPaulsen, JLScocchera, EWViswanathan, K Heterocyclic analogs of propargyl-linked inhibitors of dihydrofolate reductase US Patent  US8853228 Publication Date 10/7/2014 
Target
Name:
Dihydrofolate reductase
Synonyms:
DYR_STAAU Dihydrofolate reductase Tetrahydrofolate dehydrogenase | folA
Type:
Enzyme
Mol. Mass.:
18249.71
Organism:
Staphylococcus aureus
Description:
Residue:
159
  
Inhibitor
Name:
BDBM50429697
Synonyms:
CHEMBL2335419
Type:
Small organic molecule
Emp. Form.:
C22H23N5O
Mol. Mass.:
373.4509
SMILES:
CCc1nc(N)nc(N)c1C#CC(C)c1cc(OC)cc(c1)-c1ccncc1
: