Target
C5a anaphylatoxin chemotactic receptor 1
Ligand
BDBM23571
Substrate
Meas. Tech.
FLIPR Assay
IC50
49±n/a nM
Citation
 Adams, CMDarsigny, VFlyer, ANGelin, CFHurley, TBJi, NKarki, RGKawanami, TMeredith, ERao, CSerrano-Wu, MHSolovay, CF Tetrahydropyrido-pyridine and tetrahydropyrido-pyrimidine compounds and use thereof as C5a receptor modulators US Patent  US8846656 Publication Date 9/30/2014 
Target
Name:
C5a anaphylatoxin chemotactic receptor 1
Synonyms:
C5AR C5AR1_HUMAN C5a anaphylatoxin chemotactic receptor C5a-R | CD_antigen=CD88
Type:
Enzyme
Mol. Mass.:
39347.68
Organism:
Homo sapiens (Human)
Description:
P21730
Residue:
350
  
Inhibitor
Name:
BDBM23571
Synonyms:
US8846656, 41-D | US8846656, 43-A
Type:
Emp. Form.:
C27H30N4
Mol. Mass.:
410.5539
SMILES:
CC(C)c1ccc(C)c(c1)N1CCc2nc(cc(C)c2C1)-c1c(C)ccc2[nH]ncc12
: