Target
C5a anaphylatoxin chemotactic receptor 1
Ligand
BDBM134577
Substrate
Meas. Tech.
FLIPR Assay
IC50
1±n/a nM
Citation
 Adams, CMDarsigny, VFlyer, ANGelin, CFHurley, TBJi, NKarki, RGKawanami, TMeredith, ERao, CSerrano-Wu, MHSolovay, CF Tetrahydropyrido-pyridine and tetrahydropyrido-pyrimidine compounds and use thereof as C5a receptor modulators US Patent  US8846656 Publication Date 9/30/2014 
Target
Name:
C5a anaphylatoxin chemotactic receptor 1
Synonyms:
C5AR C5AR1_HUMAN C5a anaphylatoxin chemotactic receptor C5a-R | CD_antigen=CD88
Type:
Enzyme
Mol. Mass.:
39347.68
Organism:
Homo sapiens (Human)
Description:
P21730
Residue:
350
  
Inhibitor
Name:
BDBM134577
Synonyms:
US8846656, 55-M
Type:
Small organic molecule
Emp. Form.:
C30H37ClN8O
Mol. Mass.:
561.121
SMILES:
CO[C@@H]1CCN([C@H](C)C1)c1nc(nc2CCN(Cc12)c1c(Cl)c(nn1C)C1CC1)-c1c(C)ccc2[nH]nc(C)c12
: