Target
C5a anaphylatoxin chemotactic receptor 1
Ligand
BDBM134593
Substrate
Meas. Tech.
FLIPR Assay
IC50
4±n/a nM
Citation
 Adams, CMDarsigny, VFlyer, ANGelin, CFHurley, TBJi, NKarki, RGKawanami, TMeredith, ERao, CSerrano-Wu, MHSolovay, CF Tetrahydropyrido-pyridine and tetrahydropyrido-pyrimidine compounds and use thereof as C5a receptor modulators US Patent  US8846656 Publication Date 9/30/2014 
Target
Name:
C5a anaphylatoxin chemotactic receptor 1
Synonyms:
C5AR C5AR1_HUMAN C5a anaphylatoxin chemotactic receptor C5a-R | CD_antigen=CD88
Type:
Enzyme
Mol. Mass.:
39347.68
Organism:
Homo sapiens (Human)
Description:
P21730
Residue:
350
  
Inhibitor
Name:
BDBM134593
Synonyms:
US8846656, 69-H
Type:
Small organic molecule
Emp. Form.:
C27H31ClN8O
Mol. Mass.:
519.041
SMILES:
C[C@H]1[C@H](O)CN1c1nc(nc2CCN(Cc12)c1c(Cl)c(nn1C)C1CC1)-c1c(C)ccc2[nH]nc(C)c12
: