Target
D(1A) dopamine receptor
Ligand
BDBM285653
Substrate
Meas. Tech.
Human D1 Receptor Binding Assay
pH
7.4±n/a
Ki
900±n/a nM
Comments
extracted
Citation
 Gray, DLZhang, LDavoren, JEDounay, ABEfremov, IVLee, CMente, SRO Neil, SVRogers, BNSubramanyam, C Heteroaromatic compounds and their use as dopamine D1 ligands US Patent  US10077272 Publication Date 9/18/2018 
Target
Name:
D(1A) dopamine receptor
Synonyms:
DA D1 receptor DRD1 Dopamine D1 receptor Dopamine D1A
Type:
Enzyme
Mol. Mass.:
49303.43
Organism:
Homo sapiens (Human)
Description:
P21728
Residue:
446
  
Inhibitor
Name:
BDBM285653
Synonyms:
6-[4-(furo[2,3-d]pyrimidin-4-yloxy)phenyl]-1-(2-methoxyethyl)-5-methylpyrimidine-2,4(1H,3H)-dione US9868744, 19
Type:
Small organic molecule
Emp. Form.:
C20H18N4O5
Mol. Mass.:
394.3807
SMILES:
COCCn1c(-c2ccc(Oc3ncnc4occc34)cc2)c(C)c(=O)[nH]c1=O
: