Target
Platelet-derived growth factor receptor beta
Ligand
BDBM4845
Substrate
Poly(E:Y)
Meas. Tech.
Kinase Inhibition Assay
IC50
2890±n/a nM
Citation
 Connolly, CJHamby, JMSchroeder, MCBarvian, MLu, GHPanek, RLAmar, AShen, CKraker, AJFry, DWKlohs, WDDoherty, AM DISCOVERY AND STRUCTURE-ACTIVITY STUDIES OF A NOVEL SERIES OF PYRIDO[2,3-d]PYRIMIDINE TYROSINE KINASE INHIBITORS Bioorg Med Chem Lett 7:2415-20 (1997)    Article 
Target
Name:
Platelet-derived growth factor receptor beta
Synonyms:
Beta-type platelet-derived growth factor receptor CD140b antigen PDGF Receptor Substrate PDGFR PDGFR-1 PDGFRB PGFRB_HUMAN Platelet-derived growth factor receptor 1 Platelet-derived growth factor receptor beta (PDGFR-beta) Platelet-derived growth factor receptor beta (PDGFRbeta) | VHL/PDGFRB
Type:
Enzyme
Mol. Mass.:
123922.25
Organism:
Homo sapiens (Human)
Description:
P09619
Residue:
1106
  
Inhibitor
Name:
BDBM4845
Synonyms:
1-[2-amino-6-(4-methoxyphenyl)pyrido[2,3-d]pyrimidin-7-yl]-3-tert-butylurea | PD089828 analog 26
Type:
Small organic molecule
Emp. Form.:
C19H22N6O2
Mol. Mass.:
366.417
SMILES:
COc1ccc(cc1)-c1cc2cnc(N)nc2nc1NC(=O)NC(C)(C)C
:
Substrate
Name:
Poly(E:Y)
Synonyms:
Type:
Random polymer
Mol. Mass.:
358.43
Organism:
Description:
Random copolymer of glutamic acid and tyrosine (4:1). 50 uM ATP containing 0.4 uCi of [gamma-32P]ATP as co-substrate
Residue:
3
NA