Target
Cannabinoid receptor 2
Ligand
BDBM135878
Substrate
Meas. Tech.
Radioligand Binding Assay
pH
7.4±n/a
Temperature
303.15±n/a K
Ki
2.8±n/a nM
Comments
extracted
Citation
 Carroll, WADart, MJFrost, JMLatshaw, SPKolasa, TLi, TPeddi, SLiu, BPerez-Medrano, APatel, MWang, XNelson, DW Compounds as cannabinoid receptor ligands US Patent  US8859596 Publication Date 10/14/2014 
Target
Name:
Cannabinoid receptor 2
Synonyms:
CANNABINOID CB2 CB2 CB2B CNR2_HUMAN Cannabinoid CB2 receptor Cannabinoid receptor 2 (CB2R) | hCB2
Type:
G Protein-Coupled Receptor (GPCR)
Mol. Mass.:
39690.94
Organism:
Homo sapiens (Human)
Description:
P34972
Residue:
360
  
Inhibitor
Name:
BDBM135878
Synonyms:
US8859596, 165
Type:
Small organic molecule
Emp. Form.:
C23H31F3N4O2S
Mol. Mass.:
484.578
SMILES:
CC(C)(C)NOc1ccc(cc1C(=O)\N=c1/sc(nn1CC1CCC1)C(C)(C)C)C(F)(F)F
: