Target
Cannabinoid receptor 2
Ligand
BDBM135900
Substrate
Meas. Tech.
Radioligand Binding Assay
pH
7.4±n/a
Ki
0.9±n/a nM
Comments
extracted
Citation
 Carroll, WADart, MJFrost, JMLatshaw, SPKolasa, TLi, TPeddi, SLiu, BPerez-Medrano, APatel, MWang, XNelson, DW Compounds as cannabinoid receptor ligands US Patent  US8859596 Publication Date 10/14/2014 
Target
Name:
Cannabinoid receptor 2
Synonyms:
CANNABINOID CB2 CB2 Cannabinoid CB2 receptor Cnr2 | rCB2
Type:
Enzyme
Mol. Mass.:
39366.68
Organism:
Rattus norvegicus (Rat)
Description:
Q9QZN9
Residue:
360
  
Inhibitor
Name:
BDBM135900
Synonyms:
US8859596, 188
Type:
Small organic molecule
Emp. Form.:
C22H28F3N5O2S
Mol. Mass.:
483.55
SMILES:
CCCCn1nc(s\c1=N/C(=O)c1cc(ccc1ON=C(N)C1CC1)C(F)(F)F)C(C)(C)C
: